Target
Cytochrome P450 1A2
Ligand
BDBM50020408
Substrate
Meas. Tech.
ChEMBL_1366637 (CHEMBL3296731)
IC50
5200±n/a nM
Target
Name:
Cytochrome P450 1A2
Synonyms:
CP1A2_HUMAN CYPIA2 Cytochrome P(3)450 Cytochrome P450 1A2 (CYP1A2) Cytochrome P450-P3
Type:
Enzyme
Mol. Mass.:
58423.38
Organism:
Homo sapiens (Human)
Description:
P05177
Residue:
516
  
Inhibitor
Name:
BDBM50020408
Synonyms:
CHEMBL3289805
Type:
Small organic molecule
Emp. Form.:
C14H12Cl2N4O
Mol. Mass.:
323.177
SMILES:
Nc1nc2cccnc2n1CC(O)c1cccc(Cl)c1Cl
: