Target
Potassium voltage-gated channel subfamily H member 2
Ligand
BDBM50020415
Substrate
Meas. Tech.
ChEMBL_1366626 (CHEMBL3296720)
IC50
12200±n/a nM
Target
Name:
Potassium voltage-gated channel subfamily H member 2
Synonyms:
1,3-beta-glucan synthase component GLS2 ERG Eag-related protein 1 Ether-a-go-go-related gene (HERG) Ether-a-go-go-related gene potassium channel 1 Ether-a-go-go-related gene potassium channel 1 (hERG1) Ether-a-go-go-related protein 1 H-ERG KCNH2 Potassium voltage-gated channel subfamily H member 2 (hERG) Voltage-gated potassium channel subunit Kv11.1 hERG Potassium Channel 1 | putative potassium channel subunit
Type:
Multi-pass membrane protein
Mol. Mass.:
126672.65
Organism:
Homo sapiens (Human)
Description:
Q12809
Residue:
1159
  
Inhibitor
Name:
BDBM50020415
Synonyms:
CHEMBL3289806
Type:
Small organic molecule
Emp. Form.:
C20H22ClF3N6O
Mol. Mass.:
454.876
SMILES:
CN1CCN(CC1)c1ccc2nc(N)n(CC(O)c3ccc(cc3Cl)C(F)(F)F)c2n1
: