Target
Cytochrome P450 3A4
Ligand
BDBM50020411
Substrate
Meas. Tech.
ChEMBL_1366633 (CHEMBL3296727)
IC50
20300±n/a nM
Target
Name:
Cytochrome P450 3A4
Synonyms:
Albendazole monooxygenase CP3A4_HUMAN CYP3A4 CYPIIIA4 Cytochrome P450 3A4 (CYP3A4) Nifedipine oxidase Taurochenodeoxycholate 6-alpha-hydroxylase
Type:
Enzyme
Mol. Mass.:
57349.57
Organism:
Homo sapiens (Human)
Description:
Residue:
503
  
Inhibitor
Name:
BDBM50020411
Synonyms:
CHEMBL3289813
Type:
Small organic molecule
Emp. Form.:
C18H15ClF6N4O2
Mol. Mass.:
468.781
SMILES:
CC(Oc1ccc2nc(N)n(CC(O)c3ccc(cc3Cl)C(F)(F)F)c2n1)C(F)(F)F
: