Target
Cytochrome P450 2C9
Ligand
BDBM50020411
Substrate
Meas. Tech.
ChEMBL_1366635 (CHEMBL3296729)
IC50
22900±n/a nM
Target
Name:
Cytochrome P450 2C9
Synonyms:
(R)-limonene 6-monooxygenase CP2C9_HUMAN CYP2C9 Cytochrome P450 2C9 (CYP2C9 ) P-450MP P450 PB-1 | S-mephenytoin 4-hydroxylase
Type:
Enzyme
Mol. Mass.:
55636.33
Organism:
Homo sapiens (Human)
Description:
P11712
Residue:
490
  
Inhibitor
Name:
BDBM50020411
Synonyms:
CHEMBL3289813
Type:
Small organic molecule
Emp. Form.:
C18H15ClF6N4O2
Mol. Mass.:
468.781
SMILES:
CC(Oc1ccc2nc(N)n(CC(O)c3ccc(cc3Cl)C(F)(F)F)c2n1)C(F)(F)F
: