Target
Cytochrome P450 3A4
Ligand
BDBM50020404
Substrate
Meas. Tech.
ChEMBL_1366633 (CHEMBL3296727)
IC50
>30000±n/a nM
Target
Name:
Cytochrome P450 3A4
Synonyms:
Albendazole monooxygenase CP3A4_HUMAN CYP3A4 CYPIIIA4 Cytochrome P450 3A4 (CYP3A4) Nifedipine oxidase Taurochenodeoxycholate 6-alpha-hydroxylase
Type:
Enzyme
Mol. Mass.:
57349.57
Organism:
Homo sapiens (Human)
Description:
Residue:
503
  
Inhibitor
Name:
BDBM50020404
Synonyms:
CHEMBL3289803
Type:
Small organic molecule
Emp. Form.:
C17H12ClF6N3O
Mol. Mass.:
423.74
SMILES:
Nc1nc2ccc(cc2n1CC(O)c1ccc(cc1Cl)C(F)(F)F)C(F)(F)F
: