Target
Cytochrome P450 3A4
Ligand
BDBM50020408
Substrate
Meas. Tech.
ChEMBL_1366633 (CHEMBL3296727)
IC50
>30000±n/a nM
Target
Name:
Cytochrome P450 3A4
Synonyms:
Albendazole monooxygenase CP3A4_HUMAN CYP3A4 CYPIIIA4 Cytochrome P450 3A4 (CYP3A4) Nifedipine oxidase Taurochenodeoxycholate 6-alpha-hydroxylase
Type:
Enzyme
Mol. Mass.:
57349.57
Organism:
Homo sapiens (Human)
Description:
Residue:
503
  
Inhibitor
Name:
BDBM50020408
Synonyms:
CHEMBL3289805
Type:
Small organic molecule
Emp. Form.:
C14H12Cl2N4O
Mol. Mass.:
323.177
SMILES:
Nc1nc2cccnc2n1CC(O)c1cccc(Cl)c1Cl
: