Target
Cytochrome P450 1A2
Ligand
BDBM50020412
Substrate
Meas. Tech.
ChEMBL_1366637 (CHEMBL3296731)
IC50
>30000±n/a nM
Target
Name:
Cytochrome P450 1A2
Synonyms:
CP1A2_HUMAN CYPIA2 Cytochrome P(3)450 Cytochrome P450 1A2 (CYP1A2) Cytochrome P450-P3
Type:
Enzyme
Mol. Mass.:
58423.38
Organism:
Homo sapiens (Human)
Description:
P05177
Residue:
516
  
Inhibitor
Name:
BDBM50020412
Synonyms:
CHEMBL3289811
Type:
Small organic molecule
Emp. Form.:
C19H18ClF3N4O3
Mol. Mass.:
442.819
SMILES:
Nc1nc2ccc(OC3CCOC3)nc2n1CC(O)c1ccc(cc1Cl)C(F)(F)F
: