Target
Cytochrome P450 1A2
Ligand
BDBM50020411
Substrate
Meas. Tech.
ChEMBL_1366637 (CHEMBL3296731)
IC50
>30000±n/a nM
Target
Name:
Cytochrome P450 1A2
Synonyms:
CP1A2_HUMAN CYPIA2 Cytochrome P(3)450 Cytochrome P450 1A2 (CYP1A2) Cytochrome P450-P3
Type:
Enzyme
Mol. Mass.:
58423.38
Organism:
Homo sapiens (Human)
Description:
P05177
Residue:
516
  
Inhibitor
Name:
BDBM50020411
Synonyms:
CHEMBL3289813
Type:
Small organic molecule
Emp. Form.:
C18H15ClF6N4O2
Mol. Mass.:
468.781
SMILES:
CC(Oc1ccc2nc(N)n(CC(O)c3ccc(cc3Cl)C(F)(F)F)c2n1)C(F)(F)F
: