Target
Cytochrome P450 2D6
Ligand
BDBM50020415
Substrate
Meas. Tech.
ChEMBL_1366634 (CHEMBL3296728)
IC50
27900±n/a nM
Target
Name:
Cytochrome P450 2D6
Synonyms:
CP2D6_HUMAN CYP2DL1 Cytochrome P450 2D6 (CYP2D6) P450-DB1
Type:
Protein
Mol. Mass.:
55774.82
Organism:
Homo sapiens (Human)
Description:
P10635
Residue:
497
  
Inhibitor
Name:
BDBM50020415
Synonyms:
CHEMBL3289806
Type:
Small organic molecule
Emp. Form.:
C20H22ClF3N6O
Mol. Mass.:
454.876
SMILES:
CN1CCN(CC1)c1ccc2nc(N)n(CC(O)c3ccc(cc3Cl)C(F)(F)F)c2n1
: