Target
Cytochrome P450 2D6
Ligand
BDBM50020411
Substrate
Meas. Tech.
ChEMBL_1366634 (CHEMBL3296728)
IC50
28300±n/a nM
Target
Name:
Cytochrome P450 2D6
Synonyms:
CP2D6_HUMAN CYP2DL1 Cytochrome P450 2D6 (CYP2D6) P450-DB1
Type:
Protein
Mol. Mass.:
55774.82
Organism:
Homo sapiens (Human)
Description:
P10635
Residue:
497
  
Inhibitor
Name:
BDBM50020411
Synonyms:
CHEMBL3289813
Type:
Small organic molecule
Emp. Form.:
C18H15ClF6N4O2
Mol. Mass.:
468.781
SMILES:
CC(Oc1ccc2nc(N)n(CC(O)c3ccc(cc3Cl)C(F)(F)F)c2n1)C(F)(F)F
: