Target
Cytochrome P450 1A2
Ligand
BDBM50020404
Substrate
Meas. Tech.
ChEMBL_1366637 (CHEMBL3296731)
IC50
29400±n/a nM
Target
Name:
Cytochrome P450 1A2
Synonyms:
CP1A2_HUMAN CYPIA2 Cytochrome P(3)450 Cytochrome P450 1A2 (CYP1A2) Cytochrome P450-P3
Type:
Enzyme
Mol. Mass.:
58423.38
Organism:
Homo sapiens (Human)
Description:
P05177
Residue:
516
  
Inhibitor
Name:
BDBM50020404
Synonyms:
CHEMBL3289803
Type:
Small organic molecule
Emp. Form.:
C17H12ClF6N3O
Mol. Mass.:
423.74
SMILES:
Nc1nc2ccc(cc2n1CC(O)c1ccc(cc1Cl)C(F)(F)F)C(F)(F)F
: