Target
Polyunsaturated fatty acid 5-lipoxygenase
Ligand
BDBM50067028
Substrate
Meas. Tech.
ChEMBL_1361560 (CHEMBL3295127)
IC50
800±n/a nM
Citation
 Koeberle, AMuņoz, EAppendino, GBMinassi, APace, SRossi, AWeinigel, CBarz, DSautebin, LCaprioglio, DCollado, JAWerz, O SAR studies on curcumin's pro-inflammatory targets: discovery of prenylated pyrazolocurcuminoids as potent and selective novel inhibitors of 5-lipoxygenase. J Med Chem 57:5638-48 (2014)  
Target
Name:
Polyunsaturated fatty acid 5-lipoxygenase
Synonyms:
5-LO 5-Lipoxygenase (5-LO) 5-Lipoygenase ALOX5 LOG5 | LOX5_HUMAN
Type:
Enzyme
Mol. Mass.:
77972.74
Organism:
Homo sapiens (Human)
Description:
Recombinant protein was purified from E. coli lysate. After ammonium sulfate precipitation and subsequent steps, the supernatant (S100) was used for 5-LO activity assay.
Residue:
674
  
Inhibitor
Name:
BDBM50067028
Synonyms:
(1E,4E)-1,5-Bis-(4-hydroxy-3-methoxy-phenyl)-penta-1,4-dien-3-one 1,5-Bis(4-hydroxy-3-methoxyphenyl)penta-1,4-dien-3-one 1,5-bis-(4-hydroxy-3-methoxyphenyl)-penta-1,4-dien-3-one Go-Y022
Type:
Small organic molecule
Emp. Form.:
C19H18O5
Mol. Mass.:
326.3432
SMILES:
COc1cc(\C=C\C(=O)\C=C\c2ccc(O)c(OC)c2)ccc1O
: