Target
Cannabinoid receptor 1
Ligand
BDBM50020593
Substrate
Meas. Tech.
ChEMBL_1361904 (CHEMBL3293300)
Ki
4064±n/a nM
Citation
 Pinna, GLoriga, GLazzari, PRuiu, SFalzoi, MFrau, SPau, AMurineddu, GAsproni, BPinna, GA Tricyclic pyrazoles. Part 6. Benzofuro[3,2-c]pyrazole: a versatile architecture for CB2 selective ligands. Eur J Med Chem 82:281-92 (2014)  
Target
Name:
Cannabinoid receptor 1
Synonyms:
Brain-type cannabinoid receptor CB-R CNR1_MOUSE Cannabinoid receptor | Cnr1
Type:
Enzyme
Mol. Mass.:
52842.52
Organism:
Mus musculus (Mouse)
Description:
P47746
Residue:
473
  
Inhibitor
Name:
BDBM50020593
Synonyms:
CHEMBL3290443
Type:
Small organic molecule
Emp. Form.:
C21H18Cl2N4O3
Mol. Mass.:
445.299
SMILES:
Cc1ccc2c(c1)oc1c(nn(-c3ccc(Cl)cc3Cl)c21)C(=O)NN1CCOCC1
: