Target
Proteasome subunit beta type-5
Ligand
BDBM50021353
Substrate
Meas. Tech.
ChEMBL_1366689 (CHEMBL3296840)
Ki
60±n/a nM
Citation
 Troiano, VScarbaci, KEttari, RMicale, NCerchia, CPinto, ASchirmeister, TNovellino, EGrasso, SLavecchia, AZappalą, M Optimization of peptidomimetic boronates bearing a P3 bicyclic scaffold as proteasome inhibitors. Eur J Med Chem 83:1-14 (2014)  
Target
Name:
Proteasome subunit beta type-5
Synonyms:
20S proteasome chymotrypsin-like LMPX PSB5_HUMAN Proteasome Macropain subunit MB1 X
Type:
Protein
Mol. Mass.:
28480.96
Organism:
Homo sapiens (Human)
Description:
Residue:
263
  
Inhibitor
Name:
BDBM50021353
Synonyms:
CHEMBL3287944
Type:
Small organic molecule
Emp. Form.:
C17H22BBrN2O4
Mol. Mass.:
409.083
SMILES:
CC(C)C[C@H](NC(=O)CCn1ccc2ccc(Br)cc2c1=O)B(O)O
: