Target
Beta-3 adrenergic receptor
Ligand
BDBM50021866
Substrate
Meas. Tech.
ChEMBL_1369178
EC50
10.0±n/a nM
Citation
 McKinnell, RMKlein, ULinsell, MSMoran, EJNodwell, MBPfeiffer, JWThomas, GRYu, CJacobsen, JR Discovery of TD-4306, a long-actingß2-agonist for the treatment of asthma and COPD. Bioorg Med Chem Lett 24:2871-6 (2014)  
Target
Name:
Beta-3 adrenergic receptor
Synonyms:
ADRB3 ADRB3_HUMAN Beta-2 adrenergic receptor and beta-3 adrenergic receptor Beta-3 adrenoreceptor | adrenergic Beta3
Type:
G Protein-Coupled Receptor (GPCR)
Mol. Mass.:
43534.88
Organism:
Homo sapiens (Human)
Description:
Residue:
408
  
Inhibitor
Name:
BDBM50021866
Synonyms:
CHEMBL3298326
Type:
Small organic molecule
Emp. Form.:
C33H34N4O4
Mol. Mass.:
550.6475
SMILES:
COc1ccc(Nc2ccc(CCNC[C@H](O)c3ccc(O)c4[nH]c(=O)ccc34)cc2)cc1-c1ccc(CN)cc1
: