Target
Chitinase
Ligand
BDBM50022885
Substrate
Meas. Tech.
ChEMBL_1369100 (CHEMBL3300321)
IC50
1200±n/a nM
Citation
 Gooyit, MTricoche, NLustigman, SJanda, KD Dual protonophore-chitinase inhibitors dramatically affect O. volvulus molting. J Med Chem 57:5792-9 (2014)  
Target
Name:
Chitinase
Synonyms:
Type:
PROTEIN
Mol. Mass.:
55694.80
Organism:
Onchocerca volvulus
Description:
ChEMBL_1369100
Residue:
497
  
Inhibitor
Name:
BDBM50022885
Synonyms:
CHEMBL3298106
Type:
Small organic molecule
Emp. Form.:
C19H12ClI2NO3
Mol. Mass.:
591.565
SMILES:
Oc1c(I)cc(I)cc1C(=O)Nc1ccc(Oc2ccccc2Cl)cc1
: