Target
25-hydroxyvitamin D-1 alpha hydroxylase, mitochondrial
Ligand
BDBM50023359
Substrate
Meas. Tech.
ChEMBL_1459634 (CHEMBL3369891)
Ki
5.7±n/a nM
Citation
 Ferla, SAboraia, ASBrancale, APepper, CJZhu, JOchalek, JTDeLuca, HFSimons, C Small-molecule inhibitors of 25-hydroxyvitamin D-24-hydroxylase (CYP24A1): synthesis and biological evaluation. J Med Chem 57:7702-15 (2014)  
Target
Name:
25-hydroxyvitamin D-1 alpha hydroxylase, mitochondrial
Synonyms:
25-OHD-1 alpha-hydroxylase 25-hydroxyvitamin D-1 alpha hydroxylase, mitochondrial Calcidiol 1-monooxygenase Cyp27b Cyp40 Cytochrome P450C1 alpha Cytochrome p450 27B1 | VD3 1A hydroxylase
Type:
PROTEIN
Mol. Mass.:
56238.51
Organism:
Mus musculus
Description:
ChEMBL_109473
Residue:
507
  
Inhibitor
Name:
BDBM50023359
Synonyms:
CHEMBL3329778
Type:
Small organic molecule
Emp. Form.:
C24H24N2O
Mol. Mass.:
356.4602
SMILES:
CC(C)(C)C(=O)C(=C\c1ccc(\C=C\c2ccccc2)cc1)\n1ccnc1
: