Target
cAMP-specific 3',5'-cyclic phosphodiesterase 4D
Ligand
BDBM14774
Substrate
Meas. Tech.
ChEMBL_1446363 (CHEMBL3374902)
IC50
0.700000±n/a nM
Citation
 Boland, SAlen, JBourin, ACastermans, KBoumans, NPanitti, LVanormelingen, JLeysen, DDefert, O Novel Roflumilast analogs as soft PDE4 inhibitors. Bioorg Med Chem Lett 24:4594-7 (2014)  
Target
Name:
cAMP-specific 3',5'-cyclic phosphodiesterase 4D
Synonyms:
3',5'-cyclic phosphodiesterase PDE43 PDE4D_HUMAN | Phosphodiesterase 4D
Type:
Protein
Mol. Mass.:
91092.69
Organism:
Homo sapiens (Human)
Description:
Q08499
Residue:
809
  
Inhibitor
Name:
BDBM14774
Synonyms:
3-(cyclopropylmethoxy)-N-(3,5-dichloropyridin-4-yl)-4-(difluoromethoxy)benzamide DAXAS Roflumilast
Type:
Small organic molecule
Emp. Form.:
C17H14Cl2F2N2O3
Mol. Mass.:
403.207
SMILES:
FC(F)Oc1ccc(cc1OCC1CC1)C(=O)Nc1c(Cl)cncc1Cl
: