Target
Histone deacetylase 1
Ligand
BDBM50024655
Substrate
Meas. Tech.
ChEMBL_1438101 (CHEMBL3388476)
IC50
152±n/a nM
Citation
 Cheng, JQin, JGuo, SQiu, HZhong, Y Design, synthesis and evaluation of novel HDAC inhibitors as potential antitumor agents. Bioorg Med Chem Lett 24:4768-72 (2014)  
Target
Name:
Histone deacetylase 1
Synonyms:
Cereblon/Histone deacetylase 1 HDAC1 Histone deacetylase 1 (HDAC1) RPD3L1
Type:
Enzyme
Mol. Mass.:
55090.27
Organism:
Homo sapiens (Human)
Description:
Q13547
Residue:
482
  
Inhibitor
Name:
BDBM50024655
Synonyms:
CHEMBL3334993
Type:
Small organic molecule
Emp. Form.:
C19H16N4O3
Mol. Mass.:
348.3553
SMILES:
ONC(=O)c1ccc(cc1)N1CCN(C1=O)c1cnc2ccccc2c1
: