Target
Histone deacetylase 1
Ligand
BDBM50024668
Substrate
Meas. Tech.
ChEMBL_1438101 (CHEMBL3388476)
IC50
41±n/a nM
Citation
 Cheng, JQin, JGuo, SQiu, HZhong, Y Design, synthesis and evaluation of novel HDAC inhibitors as potential antitumor agents. Bioorg Med Chem Lett 24:4768-72 (2014)  
Target
Name:
Histone deacetylase 1
Synonyms:
Cereblon/Histone deacetylase 1 HDAC1 Histone deacetylase 1 (HDAC1) RPD3L1
Type:
Enzyme
Mol. Mass.:
55090.27
Organism:
Homo sapiens (Human)
Description:
Q13547
Residue:
482
  
Inhibitor
Name:
BDBM50024668
Synonyms:
CHEMBL3334998
Type:
Small organic molecule
Emp. Form.:
C16H16N4O3
Mol. Mass.:
312.3232
SMILES:
ONC(=O)c1ccc(cc1)N1CCN(Cc2ccncc2)C1=O
: