Target
Histone deacetylase 1
Ligand
BDBM50024673
Substrate
Meas. Tech.
ChEMBL_1438101 (CHEMBL3388476)
IC50
23±n/a nM
Citation
 Cheng, JQin, JGuo, SQiu, HZhong, Y Design, synthesis and evaluation of novel HDAC inhibitors as potential antitumor agents. Bioorg Med Chem Lett 24:4768-72 (2014)  
Target
Name:
Histone deacetylase 1
Synonyms:
Cereblon/Histone deacetylase 1 HDAC1 Histone deacetylase 1 (HDAC1) RPD3L1
Type:
Enzyme
Mol. Mass.:
55090.27
Organism:
Homo sapiens (Human)
Description:
Q13547
Residue:
482
  
Inhibitor
Name:
BDBM50024673
Synonyms:
CHEMBL3335001
Type:
Small organic molecule
Emp. Form.:
C20H24N4O3
Mol. Mass.:
368.4296
SMILES:
CN(C)Cc1cccc(CN2CCN(C2=O)c2ccc(cc2)C(=O)NO)c1
: