Target
Histone deacetylase 1
Ligand
BDBM50024678
Substrate
Meas. Tech.
ChEMBL_1438101 (CHEMBL3388476)
IC50
2.7±n/a nM
Citation
 Cheng, JQin, JGuo, SQiu, HZhong, Y Design, synthesis and evaluation of novel HDAC inhibitors as potential antitumor agents. Bioorg Med Chem Lett 24:4768-72 (2014)  
Target
Name:
Histone deacetylase 1
Synonyms:
Cereblon/Histone deacetylase 1 HDAC1 Histone deacetylase 1 (HDAC1) RPD3L1
Type:
Enzyme
Mol. Mass.:
55090.27
Organism:
Homo sapiens (Human)
Description:
Q13547
Residue:
482
  
Inhibitor
Name:
BDBM50024678
Synonyms:
CHEMBL3335006
Type:
Small organic molecule
Emp. Form.:
C26H30N4O3
Mol. Mass.:
446.5414
SMILES:
CCN(CC)Cc1ccc2cc(CN3CCN(C3=O)c3ccc(cc3)C(=O)NO)ccc2c1
: