Target
Histone deacetylase 1
Ligand
BDBM50024680
Substrate
Meas. Tech.
ChEMBL_1438101 (CHEMBL3388476)
IC50
4.0±n/a nM
Citation
 Cheng, JQin, JGuo, SQiu, HZhong, Y Design, synthesis and evaluation of novel HDAC inhibitors as potential antitumor agents. Bioorg Med Chem Lett 24:4768-72 (2014)  
Target
Name:
Histone deacetylase 1
Synonyms:
Cereblon/Histone deacetylase 1 HDAC1 Histone deacetylase 1 (HDAC1) RPD3L1
Type:
Enzyme
Mol. Mass.:
55090.27
Organism:
Homo sapiens (Human)
Description:
Q13547
Residue:
482
  
Inhibitor
Name:
BDBM50024680
Synonyms:
CHEMBL3335008
Type:
Small organic molecule
Emp. Form.:
C21H22N4O3
Mol. Mass.:
378.4244
SMILES:
Cn1cc(CCN2CCN(C2=O)c2ccc(cc2)C(=O)NO)c2ccccc12
: