Target
Serine/threonine-protein kinase B-raf
Ligand
BDBM50026693
Substrate
Meas. Tech.
ChEMBL_1436082 (CHEMBL3384713)
IC50
4.0±n/a nM
Citation
 Subramanian, SCostales, AWilliams, TELevine, BMcBride, CMPoon, DAmiri, PRenhowe, PAShafer, CMStuart, DVerhagen, JRamurthy, S Design and Synthesis of Orally Bioavailable Benzimidazole Reverse Amides as Pan RAF Kinase Inhibitors. ACS Med Chem Lett 5:989-92 (2014)  
Target
Name:
Serine/threonine-protein kinase B-raf
Synonyms:
B-RAF B-Raf proto-oncogene serine/threonine-protein kinase BRAF1 RAFB1 v-Raf murine sarcoma viral oncogene homolog B1
Type:
Serine/threonine-protein kinase
Mol. Mass.:
84446.00
Organism:
Homo sapiens (Human)
Description:
P15056
Residue:
766
  
Inhibitor
Name:
BDBM50026693
Synonyms:
CHEMBL3335378
Type:
Small organic molecule
Emp. Form.:
C24H25N5O2
Mol. Mass.:
415.4876
SMILES:
CC(C)c1ccc(Nc2nc3cc(Oc4ccnc(NC(C)=O)c4)ccc3n2C)cc1
: