Target
Kappa-type opioid receptor
Ligand
BDBM50026762
Substrate
Meas. Tech.
ChEMBL_1437491 (CHEMBL3387862)
EC50
480±n/a nM
Citation
 Mollica, ACarotenuto, ANovellino, ELimatola, ACostante, RPinnen, FStefanucci, APieretti, SBorsodi, ASamavati, RZador, FBenyhe, SDavis, PPorreca, FHruby, VJ Novel cyclic biphalin analogue with improved antinociceptive properties. ACS Med Chem Lett 5:1032-6 (2014)  
Target
Name:
Kappa-type opioid receptor
Synonyms:
KOR-1 OPIATE Kappa Opioid receptor Ror-d
Type:
G Protein-Coupled Receptor (GPCR)
Mol. Mass.:
42692.90
Organism:
Rattus norvegicus (rat)
Description:
P34975
Residue:
380
  
Inhibitor
Name:
BDBM50026762
Synonyms:
CHEMBL3331510
Type:
Small organic molecule
Emp. Form.:
C50H62N10O10S2
Mol. Mass.:
1027.218
SMILES:
CC1(C)SSC(C)(C)[C@@H](NC(=O)[C@@H](N)Cc2ccc(O)cc2)C(=O)NCC(=O)N[C@@H](Cc2ccccc2)C(=O)NNC(=O)[C@H](Cc2ccccc2)NC(=O)CNC(=O)[C@@H]1NC(=O)[C@@H](N)Cc1ccc(O)cc1
: