Target
Reverse transcriptase
Ligand
BDBM50027709
Substrate
Meas. Tech.
ChEMBL_1435391 (CHEMBL3383465)
IC50
1290±n/a nM
Citation
 Liu, ZChen, WZhan, PDe Clercq, EPannecouque, CLiu, X Design, synthesis and anti-HIV evaluation of novel diarylnicotinamide derivatives (DANAs) targeting the entrance channel of the NNRTI binding pocket through structure-guided molecular hybridization. Eur J Med Chem 87:52-62 (2014)  
Target
Name:
Reverse transcriptase
Synonyms:
Type:
Protein
Mol. Mass.:
29598.37
Organism:
Human immunodeficiency virus 1
Description:
Q9WKE8
Residue:
254
  
Inhibitor
Name:
BDBM50027709
Synonyms:
CHEMBL3338523
Type:
Small organic molecule
Emp. Form.:
C25H19N5O2
Mol. Mass.:
421.4507
SMILES:
Cc1cc(cc(C)c1Oc1cc(Nc2ccc(cc2)C#N)ncc1C(=O)NCC#C)C#N
: