Target
Reverse transcriptase
Ligand
BDBM50027824
Substrate
Meas. Tech.
ChEMBL_1435391 (CHEMBL3383465)
IC50
1200±n/a nM
Citation
 Liu, ZChen, WZhan, PDe Clercq, EPannecouque, CLiu, X Design, synthesis and anti-HIV evaluation of novel diarylnicotinamide derivatives (DANAs) targeting the entrance channel of the NNRTI binding pocket through structure-guided molecular hybridization. Eur J Med Chem 87:52-62 (2014)  
Target
Name:
Reverse transcriptase
Synonyms:
Type:
Protein
Mol. Mass.:
29598.37
Organism:
Human immunodeficiency virus 1
Description:
Q9WKE8
Residue:
254
  
Inhibitor
Name:
BDBM50027824
Synonyms:
CHEMBL3338537
Type:
Small organic molecule
Emp. Form.:
C27H28N4O3
Mol. Mass.:
456.5362
SMILES:
Cc1cc(C)c(Oc2cc(Nc3ccc(cc3)C#N)ncc2C(=O)NCC2CCCO2)c(C)c1
: