Target
Prostaglandin E synthase
Ligand
BDBM50028856
Substrate
Meas. Tech.
ChEMBL_1439892 (CHEMBL3388007)
IC50
0.100000±n/a nM
Citation
 Banerjee, APawar, MYPatil, SYadav, PSKadam, PAKattige, VGDeshpande, DSPednekar, PVPisat, MKGharat, LA Development of 2-aryl substituted quinazolin-4(3H)-one, pyrido[4,3-d]pyrimidin-4(3H)-one and pyrido[2,3-d]pyrimidin-4(3H)-one derivatives as microsomal prostaglandin E(2) synthase-1 inhibitors. Bioorg Med Chem Lett 24:4838-44 (2014)  
Target
Name:
Prostaglandin E synthase
Synonyms:
MGST1L1 PGES PTGES Prostaglandin E synthase (PGES-1) Prostaglandin E synthase-1 (PGES-1) Prostaglandin E2 synthase-1 ( mPGES-1)
Type:
Protein
Mol. Mass.:
17112.22
Organism:
Homo sapiens (Human)
Description:
Residue:
152
  
Inhibitor
Name:
BDBM50028856
Synonyms:
CHEMBL3342696 US9732066, 113
Type:
Small organic molecule
Emp. Form.:
C25H19Cl2F3N4O3
Mol. Mass.:
551.345
SMILES:
COCc1nc2c(cc(NC(=O)c3c(Cl)cccc3C(F)(F)F)cc2[nH]1)C(=O)Nc1cccc(Cl)c1C
: