Target
Bcl-2-like protein 1
Ligand
BDBM50030756
Substrate
Meas. Tech.
ChEMBL_1437735 (CHEMBL3382382)
Ki
0.280000±n/a nM
Target
Name:
Bcl-2-like protein 1
Synonyms:
Anti-apoptotic Bcl-2 protein Apoptosis regulator Bcl-X BCL2-like 1 isoform 1 BCL2L1 Bcl-2-like protein 1 (Bcl-XL) Bcl-xL/Bcl-2-binding component 3 Bcl2-antagonist of cell death (BAD)
Type:
Mitochondrion membrane; Single-pass membrane protein
Mol. Mass.:
26039.60
Organism:
Homo sapiens (Human)
Description:
Residue:
233
  
Inhibitor
Name:
BDBM50030756
Synonyms:
CHEMBL3342197
Type:
Small organic molecule
Emp. Form.:
C35H33N5O4S2
Mol. Mass.:
651.798
SMILES:
CN(C)CC#Cc1ccc(OCCCc2sc(nc2C(O)=O)N2CCc3cccc(C(=O)Nc4nc5ccccc5s4)c3C2)cc1
: