Target
Bcl-2-like protein 1
Ligand
BDBM50030762
Substrate
Meas. Tech.
ChEMBL_1437735 (CHEMBL3382382)
Ki
320±n/a nM
Target
Name:
Bcl-2-like protein 1
Synonyms:
Anti-apoptotic Bcl-2 protein Apoptosis regulator Bcl-X BCL2-like 1 isoform 1 BCL2L1 Bcl-2-like protein 1 (Bcl-XL) Bcl-xL/Bcl-2-binding component 3 Bcl2-antagonist of cell death (BAD)
Type:
Mitochondrion membrane; Single-pass membrane protein
Mol. Mass.:
26039.60
Organism:
Homo sapiens (Human)
Description:
Residue:
233
  
Inhibitor
Name:
BDBM50030762
Synonyms:
CHEMBL3342191
Type:
Small organic molecule
Emp. Form.:
C34H26N8O4S2
Mol. Mass.:
674.751
SMILES:
OC(=O)c1nc(sc1CCOc1ccc(cc1)-n1ncc2cncnc12)N1CCc2cccc(C(=O)Nc3nc4ccccc4s3)c2C1
: