Target
Bcl-2-like protein 1
Ligand
BDBM50030763
Substrate
Meas. Tech.
ChEMBL_1437733 (CHEMBL3382380)
Kd
4000000±n/a nM
Target
Name:
Bcl-2-like protein 1
Synonyms:
Anti-apoptotic Bcl-2 protein Apoptosis regulator Bcl-X BCL2-like 1 isoform 1 BCL2L1 Bcl-2-like protein 1 (Bcl-XL) Bcl-xL/Bcl-2-binding component 3 Bcl2-antagonist of cell death (BAD)
Type:
Mitochondrion membrane; Single-pass membrane protein
Mol. Mass.:
26039.60
Organism:
Homo sapiens (Human)
Description:
Residue:
233
  
Inhibitor
Name:
BDBM50030763
Synonyms:
CHEMBL3342188
Type:
Small organic molecule
Emp. Form.:
C11H8N4
Mol. Mass.:
196.208
SMILES:
c1nn(-c2ccccc2)c2ncncc12
: