Target
Apoptosis regulator Bcl-2
Ligand
BDBM50030759
Substrate
Meas. Tech.
ChEMBL_1437736 (CHEMBL3382383)
Ki
150±n/a nM
Target
Name:
Apoptosis regulator Bcl-2
Synonyms:
Apoptosis regulator Bcl-2 Protein BCL-2 BCL2_HUMAN | Bcl-2 Protein
Type:
Homodimer or heterodimer
Mol. Mass.:
26269.11
Organism:
Homo sapiens (Human)
Description:
P10415
Residue:
239
  
Inhibitor
Name:
BDBM50030759
Synonyms:
CHEMBL3342194
Type:
Small organic molecule
Emp. Form.:
C33H28N6O4S2
Mol. Mass.:
636.743
SMILES:
OC(=O)c1nc(sc1CCCOc1ccc(cc1)-n1cccn1)N1CCc2cccc(C(=O)Nc3nc4ccccc4s3)c2C1
: