Target
Apoptosis regulator Bcl-2
Ligand
BDBM50030754
Substrate
Meas. Tech.
ChEMBL_1437736 (CHEMBL3382383)
Ki
80±n/a nM
Target
Name:
Apoptosis regulator Bcl-2
Synonyms:
Apoptosis regulator Bcl-2 Protein BCL-2 BCL2_HUMAN | Bcl-2 Protein
Type:
Homodimer or heterodimer
Mol. Mass.:
26269.11
Organism:
Homo sapiens (Human)
Description:
P10415
Residue:
239
  
Inhibitor
Name:
BDBM50030754
Synonyms:
CHEMBL3342332
Type:
Small organic molecule
Emp. Form.:
C35H32FN5O4S2
Mol. Mass.:
669.788
SMILES:
CN(C)CC#Cc1ccc(OCCCc2sc(nc2C(O)=O)N2CCc3cccc(C(=O)Nc4nc5ccccc5s4)c3C2)c(F)c1
: