Target
Beta-secretase 1
Ligand
BDBM50031618
Substrate
Meas. Tech.
ChEMBL_1441677 (CHEMBL3377654)
IC50
2.3±n/a nM
Citation
 Dineen, TAChen, KCheng, ACDerakhchan, KEpstein, OEsmay, JHickman, DKreiman, CEMarx, IEWahl, RCWen, PHWeiss, MMWhittington, DAWood, SFremeau, RTWhite, RDPatel, VF Inhibitors of฿-site amyloid precursor protein cleaving enzyme (BACE1): identification of (S)-7-(2-fluoropyridin-3-yl)-3-((3-methyloxetan-3-yl)ethynyl)-5'H-spiro[chromeno[2,3-b]pyridine-5,4'-oxazol]-2'-amine (AMG-8718). J Med Chem 57:9811-31 (2014)  
Target
Name:
Beta-secretase 1
Synonyms:
ASP2 Aspartyl protease 2 BACE1 Beta-secretase (BACE) Beta-secretase 1 (BACE 1) Beta-secretase 1 (BACE1) Beta-site amyloid precursor protein cleaving enzyme 1 Memapsin-2 beta-Secretase (BACE-1) | beta-Secretase (BACE1)
Type:
Protein
Mol. Mass.:
55755.10
Organism:
Homo sapiens (Human)
Description:
P56817
Residue:
501
  
Inhibitor
Name:
BDBM50031618
Synonyms:
CHEMBL3359759
Type:
Small organic molecule
Emp. Form.:
C24H15F2N5O2
Mol. Mass.:
443.405
SMILES:
NC1=N[C@@]2(CO1)c1cc(ccc1Oc1ncc(cc21)-c1ccnc(F)c1)-c1cccnc1F
: