Target
N-acylethanolamine-hydrolyzing acid amidase
Ligand
BDBM50439657
Substrate
Meas. Tech.
ChEMBL_1440171 (CHEMBL3383170)
IC50
40.0±n/a nM
Citation
 Ponzano, SBerteotti, APetracca, RVitale, RMengatto, LBandiera, TCavalli, APiomelli, DBertozzi, FBottegoni, G Synthesis, biological evaluation, and 3D QSAR study of 2-methyl-4-oxo-3-oxetanylcarbamic acid esters as N-acylethanolamine acid amidase (NAAA) inhibitors. J Med Chem 57:10101-11 (2014)  
Target
Name:
N-acylethanolamine-hydrolyzing acid amidase
Synonyms:
ASAH-like protein N-acylethanolamine acid amidase (NAAA) N-acylethanolamine-hydrolyzing acid amidase (NAAA) N-acylethanolamine-hydrolyzing acid amidase subunit beta NAAA_RAT | Naaa
Type:
Enzyme
Mol. Mass.:
40306.53
Organism:
Rattus norvegicus (Rat)
Description:
Q5KTC7
Residue:
362
  
Inhibitor
Name:
BDBM50439657
Synonyms:
CHEMBL2419826 | US9353075, 40
Type:
Small organic molecule
Emp. Form.:
C12H21NO4
Mol. Mass.:
243.2994
SMILES:
CCCCCCCOC(=O)N[C@@H]1[C@H](C)OC1=O
: