Target
[Pyruvate dehydrogenase (acetyl-transferring)] kinase isozyme 1, mitochondrial
Ligand
BDBM50032657
Substrate
Meas. Tech.
ChEMBL_1441713 (CHEMBL3378284)
IC50
4306±n/a nM
Citation
 Meng, TZhang, DXie, ZYu, TWu, SWyder, LRegenass, UHilpert, KHuang, MGeng, MShen, J Discovery and optimization of 4,5-diarylisoxazoles as potent dual inhibitors of pyruvate dehydrogenase kinase and heat shock protein 90. J Med Chem 57:9832-43 (2014)  
Target
Name:
[Pyruvate dehydrogenase (acetyl-transferring)] kinase isozyme 1, mitochondrial
Synonyms:
PDHK1 PDK1_HUMAN Pyruvate dehydrogenase kinase 1 (PDK1) | Pyruvate dehydrogenase kinase isoform 1
Type:
Protein
Mol. Mass.:
49255.23
Organism:
Homo sapiens (Human)
Description:
Q15118
Residue:
436
  
Inhibitor
Name:
BDBM50032657
Synonyms:
CHEMBL3354663
Type:
Small organic molecule
Emp. Form.:
C29H24Cl3N3O5
Mol. Mass.:
600.877
SMILES:
COc1ccc(cc1)-c1c(\C=C\C(=O)N2CCN(CC2)c2ccc(Cl)c(Cl)c2)noc1-c1cc(Cl)c(O)cc1O
: