Target
Suppressor of tumorigenicity 14 protein
Ligand
BDBM50032705
Substrate
Meas. Tech.
ChEMBL_1441758 (CHEMBL3378881)
Ki
0.450000±n/a nM
Citation
 Duchêne, DColombo, EDésilets, ABoudreault, PLLeduc, RMarsault, ENajmanovich, R Analysis of subpocket selectivity and identification of potent selective inhibitors for matriptase and matriptase-2. J Med Chem 57:10198-204 (2014)  
Target
Name:
Suppressor of tumorigenicity 14 protein
Synonyms:
Epithin MT-SP1 PRSS14 SNC19 ST14_HUMAN Suppressor of tumorigenicity 14 protein TADG15
Type:
Single-pass type II membrane protein
Mol. Mass.:
94769.23
Organism:
Homo sapiens (Human)
Description:
Q9Y5Y6
Residue:
855
  
Inhibitor
Name:
BDBM50032705
Synonyms:
CHEMBL3354682
Type:
Small organic molecule
Emp. Form.:
C26H40N10O5S
Mol. Mass.:
604.725
SMILES:
C[C@H](NC(=O)[C@H](CC(N)=O)NC(=O)[C@@H](N)CCCCN)C(=O)N[C@@H](CCCNC(N)=N)C(=O)c1nc2ccccc2s1
: