Target
Suppressor of tumorigenicity 14 protein
Ligand
BDBM50032947
Substrate
Meas. Tech.
ChEMBL_1432691 (CHEMBL3389935)
Ki
0.830000±n/a nM
Citation
 Han, ZHarris, PKJones, DEChugani, RKim, TAgarwal, MShen, WWildman, SAJanetka, JW Inhibitors of HGFA, Matriptase, and Hepsin Serine Proteases: A Nonkinase Strategy to Block Cell Signaling in Cancer. ACS Med Chem Lett 5:1219-24 (2014)  
Target
Name:
Suppressor of tumorigenicity 14 protein
Synonyms:
Epithin MT-SP1 PRSS14 SNC19 ST14_HUMAN Suppressor of tumorigenicity 14 protein TADG15
Type:
Single-pass type II membrane protein
Mol. Mass.:
94769.23
Organism:
Homo sapiens (Human)
Description:
Q9Y5Y6
Residue:
855
  
Inhibitor
Name:
BDBM50032947
Synonyms:
CHEMBL3356606
Type:
Small organic molecule
Emp. Form.:
C29H52N12O5S
Mol. Mass.:
680.866
SMILES:
CC(C)C[C@H](NC(=O)[C@H](CCCCN)NC(=O)[C@H](CCCNC(N)=N)NC(C)=O)C(=O)N[C@@H](CCCNC(N)=N)C(=O)c1nccs1
: