Target
Melanocortin receptor 4
Ligand
BDBM50035191
Substrate
Meas. Tech.
ChEMBL_1432730 (CHEMBL3390534)
EC50
2.1±n/a nM
Citation
 Fernandes, SMLee, YSGillies, RJHruby, VJ Synthesis and evaluation of bivalent ligands for binding to the human melanocortin-4 receptor. Bioorg Med Chem 22:6360-5 (2014)  
Target
Name:
Melanocortin receptor 4
Synonyms:
MC4-R MC4R_HUMAN Melanocortin receptor 4 (MC-4) Melanocortin receptor 4 (MC4R)
Type:
Enzyme
Mol. Mass.:
36949.50
Organism:
Homo sapiens (Human)
Description:
P32245
Residue:
332
  
Inhibitor
Name:
BDBM50035191
Synonyms:
CHEMBL3354731
Type:
Small organic molecule
Emp. Form.:
C155H219N39O35
Mol. Mass.:
3188.6377
SMILES:
CCCC[C@H](NC(C)=O)C(=O)N[C@H]1CC(=O)NCCCC[C@H](NC(=O)[C@H](Cc2c[nH]c3ccccc23)NC(=O)[C@H](CCCNC(N)=N)NC(=O)[C@@H](Cc2ccc3ccccc3c2)NC(=O)[C@H](Cc2cnc[nH]2)NC1=O)C(=O)NCCCOCCOCCOCCCNC(=O)COCC(=O)N1CCC[C@H]1C(=O)NCC(=O)N1CCC[C@H]1C(=O)NCC(=O)N1CCC[C@H]1C(=O)NCC(=O)NCCCOCCOCCOCCCNC(=O)COCC(=O)N[C@@H](CCCC)C(=O)N[C@H]1CC(=O)NCCCC[C@H](NC(=O)[C@H](Cc2c[nH]c3ccccc23)NC(=O)[C@H](CCCNC(N)=N)NC(=O)[C@@H](Cc2ccc3ccccc3c2)NC(=O)[C@H](Cc2cnc[nH]2)NC1=O)C(N)=O
: