Target
4-galactosyl-N-acetylglucosaminide 3-alpha-L-fucosyltransferase 9
Ligand
BDBM92459
Substrate
Meas. Tech.
ChEMBL_1432745 (CHEMBL3390549)
Ki
77900±n/a nM
Citation
 Seelhorst, KPiernitzki, TLunau, NMeier, CHahn, U Synthesis and analysis of potentiala1,3-fucosyltransferase inhibitors. Bioorg Med Chem 22:6430-7 (2014)  
Target
Name:
4-galactosyl-N-acetylglucosaminide 3-alpha-L-fucosyltransferase 9
Synonyms:
Alpha-(1,3)-fucosyltransferase 9 FUT9_HUMAN FucT-IX Fucosyltransferase IX | Galactoside 3-L-fucosyltransferase
Type:
PROTEIN
Mol. Mass.:
42078.14
Organism:
Homo sapiens (Human)
Description:
ChEMBL_10775
Residue:
359
  
Inhibitor
Name:
BDBM92459
Synonyms:
CHEMBL384759 Guanosine Diphosphate
Type:
Small molecule
Emp. Form.:
C10H15N5O11P2
Mol. Mass.:
443.2005
SMILES:
Nc1nc2n(cnc2c(=O)[nH]1)[C@@H]1O[C@H](COP(O)(=O)OP(O)(O)=O)[C@@H](O)[C@H]1O
: