Target
Glucose-dependent insulinotropic receptor
Ligand
BDBM50036636
Substrate
Meas. Tech.
ChEMBL_1433752 (CHEMBL3387010)
EC50
1.000000±n/a nM
Citation
 Azimioara, MAlper, PCow, CMutnick, DNikulin, VLelais, GMecom, JMcNeill, MMichellys, PYWang, ZReding, EPaliotti, MLi, JBao, DZoll, JKim, YZimmerman, MGroessl, TTuntland, TJoseph, SBMcNamara, PSeidel, HMEpple, R Novel tricyclic pyrazolopyrimidines as potent and selective GPR119 agonists. Bioorg Med Chem Lett 24:5478-83 (2015)  
Target
Name:
Glucose-dependent insulinotropic receptor
Synonyms:
G-protein coupled receptor 119 (GPR119) GPR119 | Glucose-dependent insulinotropic receptor
Type:
Protein
Mol. Mass.:
36901.49
Organism:
Homo sapiens (Human)
Description:
Q8TDV5
Residue:
335
  
Inhibitor
Name:
BDBM50036636
Synonyms:
CHEMBL3354774
Type:
Small organic molecule
Emp. Form.:
C26H24F3N3O2
Mol. Mass.:
467.4829
SMILES:
CCOC(=O)[C@](C)(Cc1ccccc1)c1c(C)cnc2c(cnn12)-c1ccc(cc1)C(F)(F)F
: