Target
Glucose-dependent insulinotropic receptor
Ligand
BDBM50036640
Substrate
Meas. Tech.
ChEMBL_1433752 (CHEMBL3387010)
EC50
0.500000±n/a nM
Citation
 Azimioara, MAlper, PCow, CMutnick, DNikulin, VLelais, GMecom, JMcNeill, MMichellys, PYWang, ZReding, EPaliotti, MLi, JBao, DZoll, JKim, YZimmerman, MGroessl, TTuntland, TJoseph, SBMcNamara, PSeidel, HMEpple, R Novel tricyclic pyrazolopyrimidines as potent and selective GPR119 agonists. Bioorg Med Chem Lett 24:5478-83 (2015)  
Target
Name:
Glucose-dependent insulinotropic receptor
Synonyms:
G-protein coupled receptor 119 (GPR119) GPR119 | Glucose-dependent insulinotropic receptor
Type:
Protein
Mol. Mass.:
36901.49
Organism:
Homo sapiens (Human)
Description:
Q8TDV5
Residue:
335
  
Inhibitor
Name:
BDBM50036640
Synonyms:
CHEMBL3354778
Type:
Small organic molecule
Emp. Form.:
C26H22F3N3O2
Mol. Mass.:
465.467
SMILES:
CCOC(=O)[C@@]1(Cc2ccccc2)CCc2cnc3c(cnn3c12)-c1ccc(cc1)C(F)(F)F
: