Target
Glucose-dependent insulinotropic receptor
Ligand
BDBM50036667
Substrate
Meas. Tech.
ChEMBL_1433752 (CHEMBL3387010)
EC50
2.0±n/a nM
Citation
 Azimioara, MAlper, PCow, CMutnick, DNikulin, VLelais, GMecom, JMcNeill, MMichellys, PYWang, ZReding, EPaliotti, MLi, JBao, DZoll, JKim, YZimmerman, MGroessl, TTuntland, TJoseph, SBMcNamara, PSeidel, HMEpple, R Novel tricyclic pyrazolopyrimidines as potent and selective GPR119 agonists. Bioorg Med Chem Lett 24:5478-83 (2015)  
Target
Name:
Glucose-dependent insulinotropic receptor
Synonyms:
G-protein coupled receptor 119 (GPR119) GPR119 | Glucose-dependent insulinotropic receptor
Type:
Protein
Mol. Mass.:
36901.49
Organism:
Homo sapiens (Human)
Description:
Q8TDV5
Residue:
335
  
Inhibitor
Name:
BDBM50036667
Synonyms:
CHEMBL3354798
Type:
Small organic molecule
Emp. Form.:
C25H20F4N4O3
Mol. Mass.:
500.4449
SMILES:
COC(=O)[C@@]1(Cc2cccc(F)c2)NCc2cnc3c(c(CO)nn3c12)-c1ccc(cc1)C(F)(F)F
: