Target
Histamine H4 receptor
Ligand
BDBM50036677
Substrate
Meas. Tech.
ChEMBL_1434446 (CHEMBL3388263)
Ki
1547±n/a nM
Citation
 Savall, BMMeduna, SPVenable, JWei, JSmith, RCHack, MDThurmond, RLMcGovern, PEdwards, JP The effect of pK(a) on pyrimidine/pyridine-derived histamine H4 ligands. Bioorg Med Chem Lett 24:5489-92 (2015)  
Target
Name:
Histamine H4 receptor
Synonyms:
AXOR35 GPCR105 HH4R HRH4 Histamine H4 receptor Histamine receptor (H3 and H4) SP9144
Type:
G Protein-Coupled Receptor (GPCR)
Mol. Mass.:
44517.02
Organism:
Homo sapiens (Human)
Description:
Binding assays were using CHO cells stably expressing hH4R receptors.
Residue:
390
  
Inhibitor
Name:
BDBM50036677
Synonyms:
CHEMBL3354817
Type:
Small organic molecule
Emp. Form.:
C14H22N4
Mol. Mass.:
246.3513
SMILES:
Nc1nc(cc(n1)C1CCNCC1)C1CCCC1
: