Target
Histamine H4 receptor
Ligand
BDBM50006758
Substrate
Meas. Tech.
ChEMBL_1434446 (CHEMBL3388263)
Ki
21±n/a nM
Citation
 Savall, BMMeduna, SPVenable, JWei, JSmith, RCHack, MDThurmond, RLMcGovern, PEdwards, JP The effect of pK(a) on pyrimidine/pyridine-derived histamine H4 ligands. Bioorg Med Chem Lett 24:5489-92 (2015)  
Target
Name:
Histamine H4 receptor
Synonyms:
AXOR35 GPCR105 HH4R HRH4 Histamine H4 receptor Histamine receptor (H3 and H4) SP9144
Type:
G Protein-Coupled Receptor (GPCR)
Mol. Mass.:
44517.02
Organism:
Homo sapiens (Human)
Description:
Binding assays were using CHO cells stably expressing hH4R receptors.
Residue:
390
  
Inhibitor
Name:
BDBM50006758
Synonyms:
CHEMBL3236568
Type:
Small organic molecule
Emp. Form.:
C11H19N5
Mol. Mass.:
221.3021
SMILES:
CCc1cc(nc(N)n1)N1CC[C@H](C1)NC
: