Target
Histamine H4 receptor
Ligand
BDBM22566
Substrate
Meas. Tech.
ChEMBL_1434446 (CHEMBL3388263)
Ki
5.0±n/a nM
Citation
 Savall, BMMeduna, SPVenable, JWei, JSmith, RCHack, MDThurmond, RLMcGovern, PEdwards, JP The effect of pK(a) on pyrimidine/pyridine-derived histamine H4 ligands. Bioorg Med Chem Lett 24:5489-92 (2015)  
Target
Name:
Histamine H4 receptor
Synonyms:
AXOR35 GPCR105 HH4R HRH4 Histamine H4 receptor Histamine receptor (H3 and H4) SP9144
Type:
G Protein-Coupled Receptor (GPCR)
Mol. Mass.:
44517.02
Organism:
Homo sapiens (Human)
Description:
Binding assays were using CHO cells stably expressing hH4R receptors.
Residue:
390
  
Inhibitor
Name:
BDBM22566
Synonyms:
5-chloro-2-[(4-methylpiperazin-1-yl)carbonyl]-1H-indole JNJ 7777120
Type:
Small organic molecule
Emp. Form.:
C14H16ClN3O
Mol. Mass.:
277.749
SMILES:
CN1CCN(CC1)C(=O)c1cc2cc(Cl)ccc2[nH]1
: