Target
Lipoxygenase
Ligand
BDBM50037323
Substrate
Meas. Tech.
ChEMBL_1437303 (CHEMBL3384806)
IC50
81000±n/a nM
Citation
 Roussaki, MZelianaios, KKavetsou, EHamilakis, SHadjipavlou-Litina, DKontogiorgis, CLiargkova, TDetsi, A Structural modifications of coumarin derivatives: Determination of antioxidant and lipoxygenase (LOX) inhibitory activity. Bioorg Med Chem 22:6586-94 (2015)  
Target
Name:
Lipoxygenase
Synonyms:
Type:
PROTEIN
Mol. Mass.:
1886.07
Organism:
Glycine max
Description:
ChEMBL_103841
Residue:
18
PNSEEGLTCRGIPNSISI
  
Inhibitor
Name:
BDBM50037323
Synonyms:
CHEMBL3356686
Type:
Small organic molecule
Emp. Form.:
C17H13BrO4
Mol. Mass.:
361.187
SMILES:
COc1ccc(cc1OC)-c1cc2cc(Br)ccc2oc1=O
: