Target
Amine oxidase [flavin-containing] B
Ligand
BDBM50038173
Substrate
Meas. Tech.
ChEMBL_1440356 (CHEMBL3385618)
IC50
11±n/a nM
Citation
 Pisani, LFarina, RNicolotti, OGadaleta, DSoto-Otero, RCatto, MDi Braccio, MMendez-Alvarez, ECarotti, A In silico design of novel 2H-chromen-2-one derivatives as potent and selective MAO-B inhibitors. Eur J Med Chem 89:98-105 (2014)  
Target
Name:
Amine oxidase [flavin-containing] B
Synonyms:
AOFB_RAT Amine oxidase [flavin-containing] B Monoamine Oxidase Type B (MAO-B) Monoamine oxidase B (MAO-B) Monoamine oxidase type B (MAOB) | Monoamine oxidase-B (MAO-B)
Type:
Enzyme
Mol. Mass.:
58469.65
Organism:
Rattus norvegicus (rat)
Description:
P19643
Residue:
520
  
Inhibitor
Name:
BDBM50038173
Synonyms:
CHEMBL3139169
Type:
Small organic molecule
Emp. Form.:
C18H16BrNO3
Mol. Mass.:
374.229
SMILES:
CNCc1cc(=O)oc2cc(OCc3cccc(Br)c3)ccc12
: