Target
Amine oxidase [flavin-containing] B
Ligand
BDBM50299435
Substrate
Meas. Tech.
ChEMBL_1440356 (CHEMBL3385618)
IC50
15±n/a nM
Citation
 Pisani, LFarina, RNicolotti, OGadaleta, DSoto-Otero, RCatto, MDi Braccio, MMendez-Alvarez, ECarotti, A In silico design of novel 2H-chromen-2-one derivatives as potent and selective MAO-B inhibitors. Eur J Med Chem 89:98-105 (2014)  
Target
Name:
Amine oxidase [flavin-containing] B
Synonyms:
AOFB_RAT Amine oxidase [flavin-containing] B Monoamine Oxidase Type B (MAO-B) Monoamine oxidase B (MAO-B) Monoamine oxidase type B (MAOB) | Monoamine oxidase-B (MAO-B)
Type:
Enzyme
Mol. Mass.:
58469.65
Organism:
Rattus norvegicus (rat)
Description:
P19643
Residue:
520
  
Inhibitor
Name:
BDBM50299435
Synonyms:
4-(Aminomethyl)-7-[(3-chlorobenzyl)oxy]-2H-chromen-2-one | CHEMBL572534
Type:
Small organic molecule
Emp. Form.:
C17H14ClNO3
Mol. Mass.:
315.751
SMILES:
NCc1cc(=O)oc2cc(OCc3cccc(Cl)c3)ccc12
: