Target
Tyrosine-protein kinase BTK
Ligand
BDBM50039961
Substrate
Meas. Tech.
ChEMBL_1446183 (CHEMBL3371883)
IC50
1600±n/a nM
Citation
 Lou, YSweeney, ZKKuglstatter, ADavis, DGoldstein, DMHan, XHong, JKocer, BKondru, RKLitman, RMcIntosh, JSarma, KSuh, JTaygerly, JOwens, TD Finding the perfect spot for fluorine: improving potency up to 40-fold during a rational fluorine scan of a Bruton's Tyrosine Kinase (BTK) inhibitor scaffold. Bioorg Med Chem Lett 25:367-71 (2014)  
Target
Name:
Tyrosine-protein kinase BTK
Synonyms:
AGMX1 Agammaglobulinaemia tyrosine kinase B cell progenitor kinase BPK BTK_HUMAN Tyrosine Kinase BTK Tyrosine-protein kinase BTK (BTK)
Type:
Enzyme
Mol. Mass.:
76289.95
Organism:
Homo sapiens (Human)
Description:
Q06187
Residue:
659
  
Inhibitor
Name:
BDBM50039961
Synonyms:
CHEMBL3358334
Type:
Small organic molecule
Emp. Form.:
C27H31N5O4
Mol. Mass.:
489.5661
SMILES:
CCNC(=O)Nc1cc(cn(C)c1=O)-c1cccc(N2CCc3cc(ccc3C2=O)N(C)C)c1CO
: